{"text_format":"1","workbook":"xlsx","n_sheets":6,"sheets":["Dashboard","Daten-1","Analyse.1","Daten-2","Analyse.2","Wahlbeteiligung"],"not_rendered":{"charts":5,"images":10,"macros":1,"external_links":0,"defined_names":10,"comments":0,"pivot_tables":9},"unopened":[],"bounds":{"document_bytes":16777216,"sheet_cells":100000,"rows_first":2000,"rows_last":500,"rows_between":2000,"halvings":0,"cell_chars":16384,"cell_head_chars":4096},"cells_cut":0,"cells_raw":0,"read":"whole","date_system":"1900"}

{"sheet":"Dashboard","index":0,"n_rows":204,"n_cols":30,"rows_kept":204,"cut":false,"hidden":false,"merged":[]}
[]
[]
[]
[]
[]
[]
[]
[]
[]
[]
[]
[]
[]
[]
[]
[]
[]
[]
[]
[]
[]
[]
[]
[]
[]
[]
[]
[]
[]
[]
[]
[]
[]
[]
[null,null,null,null,null,null,null,null,null,null,null,null," "]
[]
[]
[]
[]
[]
[]
[]
[]
[]
[]
[]
[]
[]
[]
[]
[]
[]
[]
[]
[]
[]
[]
[]
[]
[]
[]
[]
[]
[]
[]
[]
[]
[]
[]
[]
[]
[]
[]
[]
[]
[]
[]
[]
[]
[]
[]
[]
[]
[]
[]
[]
[]
[]
[]
[]
[]
[]
[]
[]
[]
[]
[]
[]
[]
[]
[]
[]
[]
[]
[]
[]
[]
[]
[]
[]
[]
[]
[]
[]
[]
[]
[]
[]
[]
[]
[]
[]
[]
[]
[]
[]
[]
[]
[]
[]
[]
[]
[]
[]
[]
[]
[]
[]
[]
[]
[]
[]
[]
[]
[]
[]
[]
[]
[]
[]
[]
[]
[]
[]
[]
[]
[]
[]
[]
[null,null,{"$f":"OFFSET(Analyse.1!$B$154:$N$166,,,ROWS(Analyse.1!$B$154:$B$166)-(COUNTIF(Analyse.1!$B$154:$B$166,\"\")),COLUMNS(Analyse.1!$B$154:$N$154)-(COUNTIF(Analyse.1!$B$154:$N$154,\"\")))","v":"Zeilenbeschriftungen"},"Matthias Hauer (CDU)","Kai Gehring (GRÜNE)","Rüdiger König (FDP)","Dr. Gereon Wolters (SPD)","Martin Lange (Die PARTEI)","Stefan Keute (AfD)","Ezgi Güyildar (DIE LINKE)","Volker Wild (dieBasis)","Kai Hemsteeg (FREIE WÄHLER)","Dirk Willing (MLPD)","Diana Kummer (DKP)","Dirk Schmidt (LKR)"]
[null,null,"Gesamte Schule",309,144,87,72,25,13,9,7,6,4,3,1]
[null,null,"Unterstufe",99,44,8,18,1,4,1,0,2,1,3,1]
[null,null,"Mittelstufe",121,59,46,28,16,8,3,5,3,1,0,0]
[null,null,"Oberstufe",89,41,33,26,8,1,5,2,1,2,0,0]
[null,null,"5. Klasse",48,18,8,7,1,3,1,0,1,1,1,1]
[null,null,"6. Klasse",51,26,0,11,0,1,0,0,1,0,2,0]
[null,null,"7. Klasse",27,29,9,10,6,7,0,1,1,0,0,0]
[null,null,"8. Klasse",41,15,16,9,4,1,1,2,0,1,0,0]
[null,null,"9. Klasse",53,15,21,9,6,0,2,2,2,0,0,0]
[null,null,"EF",31,12,4,9,4,1,2,1,0,0,0,0]
[null,null,"Q1",38,17,23,9,1,0,2,0,0,0,0,0]
[null,null,"Q2",20,12,6,8,3,0,1,1,1,2,0,0]
[]
[]
[]
[]
[]
[]
[]
[]
[]
[]
[]
[]
[]
[]
[]
[]
[]
[]
[]
[null,null,{"$f":"OFFSET(Analyse.2!$B$241:$AC$253,,,ROWS(Analyse.2!$B$241:$B$253)-(COUNTIF(Analyse.2!$B$241:$B$253,\"\")),COLUMNS(Analyse.2!$B$241:$AC$241)-(COUNTIF(Analyse.2!$B$241:$AC$241,\"\")))","v":"Zeilenbeschriftungen"},"Summe von  CDU","Summe von  GRÜNE","Summe von  FDP","Summe von  SPD","Summe von  Tierschutzpartei","DIE LINKE","Team Todenhöfer","PIRATEN","AfD","Die PARTEI","dieBasis","Volt","DKP","FREIE WÄHLER","V-Partei³","NPD","MLPD","LIEBE","LKR","ÖDP","Gesundheitsforschung","Die Humanisten","du.","PdF","LfK","SGP","Bündnis C"]
[null,null,"Gesamte Schule",175,166,164,62,36,11,10,9,8,7,5,5,4,3,3,2,2,2,2,1,1,1,1,1,1,0,0]
[null,null,"Unterstufe",66,52,12,13,24,2,0,2,5,0,0,0,2,0,1,0,1,0,2,0,0,0,0,0,1,0,0]
[null,null,"Mittelstufe",65,66,78,31,8,3,8,5,3,5,4,2,1,2,2,1,0,2,0,0,1,0,1,1,0,0,0]
[null,null,"Oberstufe",44,48,74,18,4,6,2,2,0,2,1,3,1,1,0,1,1,0,0,1,0,1,0,0,0,0,0]
[null,null,"5. Klasse",31,24,8,4,13,2,0,1,4,0,0,0,0,0,0,0,1,0,2,0,0,0,0,0,0,0,0]
[null,null,"6. Klasse",35,28,4,9,11,0,0,1,1,0,0,0,2,0,1,0,0,0,0,0,0,0,0,0,1,0,0]
[null,null,"7. Klasse",18,22,14,13,5,1,1,2,2,3,1,0,1,0,0,1,0,1,0,0,1,0,0,0,0,0,0]
[null,null,"8. Klasse",18,23,27,9,1,1,4,2,1,2,0,0,0,0,0,0,0,1,0,0,0,0,1,0,0,0,0]
[null,null,"9. Klasse",29,21,37,9,2,1,3,1,0,0,3,2,0,2,2,0,0,0,0,0,0,0,0,1,0,0,0]
[null,null,"EF",17,18,20,2,1,1,1,0,0,2,0,3,0,1,0,0,0,0,0,0,0,0,0,0,0,0,0]
[null,null,"Q1",19,18,33,7,2,5,1,2,0,0,1,0,1,0,0,1,0,0,0,0,0,0,0,0,0,0,0]
[null,null,"Q2",8,12,21,9,1,0,0,0,0,0,0,0,0,0,0,0,1,0,0,1,0,1,0,0,0,0,0]

{"sheet":"Daten-1","index":1,"n_rows":14,"n_cols":10,"rows_kept":14,"cut":false,"hidden":true,"merged":[]}
["Name","Partei","5","6","7","8","9","EF","Q1","Q2"]
["Matthias Hauer","CDU",48,51,27,41,53,31,38,20]
["Dr. Gereon Wolters","SPD",7,11,10,9,9,9,9,8]
["Rüdiger König","FDP",8,0,9,16,21,4,23,6]
["Stefan Keute","AfD",3,1,7,1,null,1,null,0]
["Kai Gehring","GRÜNE",18,26,29,15,15,12,17,12]
["Ezgi Güyildar","DIE LINKE",1,null,null,1,2,2,2,1]
["Martin Lange","Die PARTEI",1,null,6,4,6,4,1,3]
["Kai Hemsteeg","FREIE WÄHLER",1,1,1,0,2,null,null,1]
["Dirk Willing","MLPD",1,null,null,1,null,null,null,2]
["Diana Kummer","DKP",1,2,null,0,null,null,null,0]
["Volker Wild","dieBasis",0,null,1,2,2,1,null,1]
["Dirk Schmidt","LKR",1,null,null,0,null,null,null,0]
["Ungültig",null,null,null,1]

{"sheet":"Analyse.1","index":2,"n_rows":166,"n_cols":21,"rows_kept":166,"cut":false,"hidden":true,"merged":[]}
[null,null,null,null,null,null,null,null,null,null,null,null,null,null,"Diagramm","Tabelle"]
["ID",{"$f":"_1Stimme[[#All],[Name]:[Partei]]","v":"Name"},"Partei","Name+Partei",{"$f":"'Daten-1'!C1:J13","v":"5"},"6","7","8","9","EF","Q1","Q2",null,"ABS??",false,true,{"$f":"IF(O2=TRUE,\"Stimmen\",\"% der Stimmen\")","v":"% der Stimmen"}]
[1,"Matthias Hauer","CDU",{"$f":"B3&\" (\"&C3&\")\"","v":"Matthias Hauer (CDU)"},48,51,27,41,53,31,38,20,null,"Alle Kandidaten??",false,true]
[2,"Dr. Gereon Wolters","SPD",{"$f":"B4&\" (\"&C4&\")\"","v":"Dr. Gereon Wolters (SPD)"},7,11,10,9,9,9,9,8,null,null,null,{"$f":"_xlfn.CONCAT(P2)","v":"WAHR"}]
[3,"Rüdiger König","FDP","Rüdiger König (FDP)",8,0,9,16,21,4,23,6,null,null,{"$f":"_xlfn.CONCAT(O3)","v":"FALSCH"},{"$f":"_xlfn.CONCAT(P3)","v":"WAHR"}]
[4,"Stefan Keute","AfD","Stefan Keute (AfD)",3,1,7,1,0,1,0,0,null,"Mixed",null,{"$f":"P4&P5","v":"WAHRWAHR"}]
[5,"Kai Gehring","GRÜNE","Kai Gehring (GRÜNE)",18,26,29,15,15,12,17,12,null,"Nachkommastellen",null,4]
[6,"Ezgi Güyildar","DIE LINKE","Ezgi Güyildar (DIE LINKE)",1,0,0,1,2,2,2,1]
[7,"Martin Lange","Die PARTEI","Martin Lange (Die PARTEI)",1,0,6,4,6,4,1,3]
[8,"Kai Hemsteeg","FREIE WÄHLER","Kai Hemsteeg (FREIE WÄHLER)",1,1,1,0,2,0,0,1]
[9,"Dirk Willing","MLPD","Dirk Willing (MLPD)",1,0,0,1,0,0,0,2]
[10,"Diana Kummer","DKP","Diana Kummer (DKP)",1,2,0,0,0,0,0,0]
[11,"Volker Wild","dieBasis","Volker Wild (dieBasis)",0,0,1,2,2,1,0,1]
[12,"Dirk Schmidt","LKR","Dirk Schmidt (LKR)",1,0,0,0,0,0,0,0]
[null,"Ungültig",0]
[]
[null,"Bereich",{"$f":"INDEX($D$3:$D$14,COLUMN(C17)-2)","v":"Matthias Hauer (CDU)"},{"$f":"INDEX($D$3:$D$14,COLUMN(D17)-2)","v":"Dr. Gereon Wolters (SPD)"},{"$f":"INDEX($D$3:$D$14,COLUMN(E17)-2)","v":"Rüdiger König (FDP)"},{"$f":"INDEX($D$3:$D$14,COLUMN(F17)-2)","v":"Stefan Keute (AfD)"},{"$f":"INDEX($D$3:$D$14,COLUMN(G17)-2)","v":"Kai Gehring (GRÜNE)"},{"$f":"INDEX($D$3:$D$14,COLUMN(H17)-2)","v":"Ezgi Güyildar (DIE LINKE)"},{"$f":"INDEX($D$3:$D$14,COLUMN(I17)-2)","v":"Martin Lange (Die PARTEI)"},{"$f":"INDEX($D$3:$D$14,COLUMN(J17)-2)","v":"Kai Hemsteeg (FREIE WÄHLER)"},{"$f":"INDEX($D$3:$D$14,COLUMN(K17)-2)","v":"Dirk Willing (MLPD)"},{"$f":"INDEX($D$3:$D$14,COLUMN(L17)-2)","v":"Diana Kummer (DKP)"},{"$f":"INDEX($D$3:$D$14,COLUMN(M17)-2)","v":"Volker Wild (dieBasis)"},{"$f":"INDEX($D$3:$D$14,COLUMN(N17)-2)","v":"Dirk Schmidt (LKR)"}]
[null,"Gesamte Schule",{"$f":"SUM(C22:C29)","v":309},{"$f":"SUM(D22:D29)","v":72},87,13,144,9,25,6,4,3,7,1]
[null,"Unterstufe",{"$f":"SUM(C22:C23)","v":99},{"$f":"SUM(D22:D23)","v":18},8,4,44,1,1,2,1,3,0,1]
[null,"Mittelstufe",{"$f":"SUM(C24:C26)","v":121},{"$f":"SUM(D24:D26)","v":28},46,8,59,3,16,3,1,0,5,0]
[null,"Oberstufe",{"$f":"SUM(C27:C29)","v":89},{"$f":"SUM(D27:D29)","v":26},33,1,41,5,8,1,2,0,2,0]
["5","5. Klasse",{"$f":"INDEX($E$3:$L$14,MATCH(C$17,$D$3:$D$14,0),MATCH($A22,$E$2:$L$2,0))","v":48},{"$f":"INDEX($E$3:$L$14,MATCH(D$17,$D$3:$D$14,0),MATCH($A22,$E$2:$L$2,0))","v":7},{"$f":"INDEX($E$3:$L$14,MATCH(E$17,$D$3:$D$14,0),MATCH($A22,$E$2:$L$2,0))","v":8},3,18,1,1,1,1,1,0,1]
["6","6. Klasse",{"$f":"INDEX($E$3:$L$14,MATCH(C$17,$D$3:$D$14,0),MATCH($A23,$E$2:$L$2,0))","v":51},11,0,1,26,0,0,1,0,2,0,0]
["7","7. Klasse",27,10,9,7,29,0,6,1,0,0,1,0]
["8","8. Klasse",41,9,16,1,15,1,4,0,1,0,2,0]
["9","9. Klasse",53,9,21,0,15,2,6,2,0,0,2,0]
["EF","EF",31,9,4,1,12,2,4,0,0,0,1,0]
["Q1","Q1",{"$f":"INDEX($E$3:$L$14,MATCH(C$17,$D$3:$D$14,0),MATCH($A28,$E$2:$L$2,0))","v":38},{"$f":"INDEX($E$3:$L$14,MATCH(D$17,$D$3:$D$14,0),MATCH($A28,$E$2:$L$2,0))","v":9},23,0,17,2,1,0,0,0,0,0]
["Q2","Q2",20,8,6,0,12,1,3,1,2,0,1,0]
[]
[null,null,{"$f":"_xlfn.SORTBY(C36:N36,C37:N37,-1)","v":" Matthias Hauer (CDU)"}," Kai Gehring (GRÜNE)"," Rüdiger König (FDP)"," Dr. Gereon Wolters (SPD)"," Martin Lange (Die PARTEI)"," Stefan Keute (AfD)"," Ezgi Güyildar (DIE LINKE)"," Volker Wild (dieBasis)"," Kai Hemsteeg (FREIE WÄHLER)"," Dirk Willing (MLPD)"," Diana Kummer (DKP)"," Dirk Schmidt (LKR)"]
[null,null,{"$f":"INDEX($C$37:$N$37,,MATCH(C31,$C$36:$N$36,0))","v":309},{"$f":"INDEX($C$37:$N$37,,MATCH(D31,$C$36:$N$36,0))","v":144},{"$f":"INDEX($C$37:$N$37,,MATCH(E31,$C$36:$N$36,0))","v":87},{"$f":"INDEX($C$37:$N$37,,MATCH(F31,$C$36:$N$36,0))","v":72},{"$f":"INDEX($C$37:$N$37,,MATCH(G31,$C$36:$N$36,0))","v":25},{"$f":"INDEX($C$37:$N$37,,MATCH(H31,$C$36:$N$36,0))","v":13},{"$f":"INDEX($C$37:$N$37,,MATCH(I31,$C$36:$N$36,0))","v":9},{"$f":"INDEX($C$37:$N$37,,MATCH(J31,$C$36:$N$36,0))","v":7},{"$f":"INDEX($C$37:$N$37,,MATCH(K31,$C$36:$N$36,0))","v":6},{"$f":"INDEX($C$37:$N$37,,MATCH(L31,$C$36:$N$36,0))","v":4},{"$f":"INDEX($C$37:$N$37,,MATCH(M31,$C$36:$N$36,0))","v":3},{"$f":"INDEX($C$37:$N$37,,MATCH(N31,$C$36:$N$36,0))","v":1}]
[]
[null,"Ranking",{"$f":"MATCH(C36,_xlfn.ANCHORARRAY($C$31),0)","v":1},{"$f":"MATCH(D36,_xlfn.ANCHORARRAY($C$31),0)","v":4},3,6,2,7,5,9,10,11,8,12]
[]
[null,"Zeilenbeschriftungen"," Matthias Hauer (CDU)"," Dr. Gereon Wolters (SPD)"," Rüdiger König (FDP)"," Stefan Keute (AfD)"," Kai Gehring (GRÜNE)"," Ezgi Güyildar (DIE LINKE)"," Martin Lange (Die PARTEI)"," Kai Hemsteeg (FREIE WÄHLER)"," Dirk Willing (MLPD)"," Diana Kummer (DKP)"," Volker Wild (dieBasis)"," Dirk Schmidt (LKR)"]
[null,"Gesamte Schule",309,72,87,13,144,9,25,6,4,3,7,1]
[null,"Unterstufe",99,18,8,4,44,1,1,2,1,3,0,1]
[null,"Mittelstufe",121,28,46,8,59,3,16,3,1,0,5,0]
[null,"Oberstufe",89,26,33,1,41,5,8,1,2,0,2,0]
[null,"5. Klasse",48,7,8,3,18,1,1,1,1,1,0,1]
[null,"6. Klasse",51,11,0,1,26,0,0,1,0,2,0,0]
[null,"7. Klasse",27,10,9,7,29,0,6,1,0,0,1,0]
[null,"8. Klasse",41,9,16,1,15,1,4,0,1,0,2,0]
[null,"9. Klasse",53,9,21,0,15,2,6,2,0,0,2,0]
[null,"EF",31,9,4,1,12,2,4,0,0,0,1,0]
[null,"Q1",38,9,23,0,17,2,1,0,0,0,0,0]
[null,"Q2",20,8,6,0,12,1,3,1,2,0,1,0]
[]
[null,{"$f":"B36:B48","v":"Zeilenbeschriftungen"},{"$f":"_xlfn.SORTBY(C36:N48,C34:N34)","v":" Matthias Hauer (CDU)"}," Kai Gehring (GRÜNE)"," Rüdiger König (FDP)"," Dr. Gereon Wolters (SPD)"," Martin Lange (Die PARTEI)"," Stefan Keute (AfD)"," Ezgi Güyildar (DIE LINKE)"," Volker Wild (dieBasis)"," Kai Hemsteeg (FREIE WÄHLER)"," Dirk Willing (MLPD)"," Diana Kummer (DKP)"," Dirk Schmidt (LKR)"]
[null,"Gesamte Schule",309,144,87,72,25,13,9,7,6,4,3,1]
[null,"Unterstufe",99,44,8,18,1,4,1,0,2,1,3,1]
[null,"Mittelstufe",121,59,46,28,16,8,3,5,3,1,0,0]
[null,"Oberstufe",89,41,33,26,8,1,5,2,1,2,0,0]
[null,"5. Klasse",48,18,8,7,1,3,1,0,1,1,1,1]
[null,"6. Klasse",51,26,0,11,0,1,0,0,1,0,2,0]
[null,"7. Klasse",27,29,9,10,6,7,0,1,1,0,0,0]
[null,"8. Klasse",41,15,16,9,4,1,1,2,0,1,0,0]
[null,"9. Klasse",53,15,21,9,6,0,2,2,2,0,0,0]
[null,"EF",31,12,4,9,4,1,2,1,0,0,0,0]
[null,"Q1",38,17,23,9,1,0,2,0,0,0,0,0]
[null,"Q2",20,12,6,8,3,0,1,1,1,2,0,0]
[]
[null,{"$f":"_xlfn.ANCHORARRAY(B50)","v":"Zeilenbeschriftungen"},{"$f":"C50:N50","v":" Matthias Hauer (CDU)"}," Kai Gehring (GRÜNE)"," Rüdiger König (FDP)"," Dr. Gereon Wolters (SPD)"," Martin Lange (Die PARTEI)"," Stefan Keute (AfD)"," Ezgi Güyildar (DIE LINKE)"," Volker Wild (dieBasis)"," Kai Hemsteeg (FREIE WÄHLER)"," Dirk Willing (MLPD)"," Diana Kummer (DKP)"," Dirk Schmidt (LKR)"]
[null,"Gesamte Schule",{"$f":"IF($O$2=TRUE,C51,C51/SUM($C51:$N51)*100)","v":45.441176470588232},{"$f":"IF($O$2=TRUE,D51,D51/SUM($C51:$N51)*100)","v":21.176470588235293},12.794117647058822,10.588235294117647,3.6764705882352944,1.911764705882353,1.3235294117647058,1.0294117647058822,0.88235294117647056,0.58823529411764708,0.44117647058823528,0.14705882352941177]
[null,"Unterstufe",{"$f":"IF($O$2=TRUE,C52,C52/SUM($C52:$N52)*100)","v":54.395604395604394},24.175824175824175,4.395604395604396,9.8901098901098905,0.5494505494505495,2.197802197802198,0.5494505494505495,0,1.098901098901099,0.5494505494505495,1.6483516483516485,0.5494505494505495]
[null,"Mittelstufe",41.724137931034484,20.344827586206897,15.862068965517242,9.6551724137931032,5.5172413793103452,2.7586206896551726,1.0344827586206897,1.7241379310344827,1.0344827586206897,0.34482758620689657,0,0]
[null,"Oberstufe",42.788461538461533,19.71153846153846,15.865384615384615,12.5,3.8461538461538463,0.48076923076923078,2.4038461538461542,0.96153846153846156,0.48076923076923078,0.96153846153846156,0,0]
[null,"5. Klasse",53.333333333333336,20,8.8888888888888893,7.7777777777777777,1.1111111111111112,3.3333333333333335,1.1111111111111112,0,1.1111111111111112,1.1111111111111112,1.1111111111111112,1.1111111111111112]
[null,"6. Klasse",55.434782608695656,28.260869565217391,0,11.956521739130435,0,1.0869565217391304,0,0,1.0869565217391304,0,2.1739130434782608,0]
[null,"7. Klasse",30,32.222222222222221,10,11.111111111111111,6.666666666666667,7.7777777777777777,0,1.1111111111111112,1.1111111111111112,0,0,0]
[null,"8. Klasse",45.555555555555557,16.666666666666664,17.777777777777779,10,4.4444444444444446,1.1111111111111112,1.1111111111111112,2.2222222222222223,0,1.1111111111111112,0,0]
[null,"9. Klasse",48.18181818181818,13.636363636363635,19.090909090909093,8.1818181818181817,5.4545454545454541,0,1.8181818181818181,1.8181818181818181,1.8181818181818181,0,0,0]
[null,"EF",48.4375,18.75,6.25,14.0625,6.25,1.5625,3.125,1.5625,0,0,0,0]
[null,"Q1",42.222222222222221,18.888888888888889,25.555555555555554,10,1.1111111111111112,0,2.2222222222222223,0,0,0,0,0]
[null,"Q2",37.037037037037038,22.222222222222221,11.111111111111111,14.814814814814813,5.5555555555555554,0,1.8518518518518516,1.8518518518518516,1.8518518518518516,3.7037037037037033,0,0]
[]
[]
[null,{"$f":"OFFSET(B64:N76,,,ROWS(_xlfn.ANCHORARRAY(B64))-COUNTIF(_xlfn.ANCHORARRAY(B64),0),IF(O3=FALSE,6,COLUMNS(B64:N64)))","v":"Zeilenbeschriftungen"}," Matthias Hauer (CDU)"," Kai Gehring (GRÜNE)"," Rüdiger König (FDP)"," Dr. Gereon Wolters (SPD)"," Martin Lange (Die PARTEI)",null,null,null,null,null,null,null,null,{"$f":"_1.Stimme_Bereich","v":"Zeilenbeschriftungen"}," Matthias Hauer (CDU)"," Kai Gehring (GRÜNE)"," Rüdiger König (FDP)"," Dr. Gereon Wolters (SPD)"," Martin Lange (Die PARTEI)"]
[null,"Gesamte Schule",45.441176470588232,21.176470588235293,12.794117647058822,10.588235294117647,3.6764705882352944,null,null,null,null,null,null,null,null,"Gesamte Schule",45.441176470588232,21.176470588235293,12.794117647058822,10.588235294117647,3.6764705882352944]
[null,"Unterstufe",54.395604395604394,24.175824175824175,4.395604395604396,9.8901098901098905,0.5494505494505495,null,null,null,null,null,null,null,null,"Unterstufe",54.395604395604394,24.175824175824175,4.395604395604396,9.8901098901098905,0.5494505494505495]
[null,"Mittelstufe",41.724137931034484,20.344827586206897,15.862068965517242,9.6551724137931032,5.5172413793103452,null,null,null,null,null,null,null,null,"Mittelstufe",41.724137931034484,20.344827586206897,15.862068965517242,9.6551724137931032,5.5172413793103452]
[null,"Oberstufe",42.788461538461533,19.71153846153846,15.865384615384615,12.5,3.8461538461538463,null,null,null,null,null,null,null,null,"Oberstufe",42.788461538461533,19.71153846153846,15.865384615384615,12.5,3.8461538461538463]
[null,"5. Klasse",53.333333333333336,20,8.8888888888888893,7.7777777777777777,1.1111111111111112,null,null,null,null,null,null,null,null,"5. Klasse",53.333333333333336,20,8.8888888888888893,7.7777777777777777,1.1111111111111112]
[null,"6. Klasse",55.434782608695656,28.260869565217391,0,11.956521739130435,0,null,null,null,null,null,null,null,null,"6. Klasse",55.434782608695656,28.260869565217391,0,11.956521739130435,0]
[null,"7. Klasse",30,32.222222222222221,10,11.111111111111111,6.666666666666667,null,null,null,null,null,null,null,null,"7. Klasse",30,32.222222222222221,10,11.111111111111111,6.666666666666667]
[null,"8. Klasse",45.555555555555557,16.666666666666664,17.777777777777779,10,4.4444444444444446,null,null,null,null,null,null,null,null,"8. Klasse",45.555555555555557,16.666666666666664,17.777777777777779,10,4.4444444444444446]
[null,"9. Klasse",48.18181818181818,13.636363636363635,19.090909090909093,8.1818181818181817,5.4545454545454541,null,null,null,null,null,null,null,null,"9. Klasse",48.18181818181818,13.636363636363635,19.090909090909093,8.1818181818181817,5.4545454545454541]
[null,"EF",48.4375,18.75,6.25,14.0625,6.25,null,null,null,null,null,null,null,null,"EF",48.4375,18.75,6.25,14.0625,6.25]
[null,"Q1",42.222222222222221,18.888888888888889,25.555555555555554,10,1.1111111111111112,null,null,null,null,null,null,null,null,"Q1",42.222222222222221,18.888888888888889,25.555555555555554,10,1.1111111111111112]
[null,"Q2",37.037037037037038,22.222222222222221,11.111111111111111,14.814814814814813,5.5555555555555554,null,null,null,null,null,null,null,null,"Q2",37.037037037037038,22.222222222222221,11.111111111111111,14.814814814814813,5.5555555555555554]
[]
[]
[null,"Zeilenbeschriftungen","Matthias Hauer (CDU)","Rüdiger König (FDP)","Kai Gehring (GRÜNE)","Dr. Gereon Wolters (SPD)","Martin Lange (Die PARTEI)"]
[null,"Gesamte Schule",45.441176470588232,12.794117647058822,21.176470588235293,10.588235294117647,3.6764705882352944]
[null,"Unterstufe",54.395604395604394,4.395604395604396,24.175824175824175,9.8901098901098905,0.5494505494505495]
[null,"Mittelstufe",41.724137931034484,15.862068965517242,20.344827586206897,9.6551724137931032,5.5172413793103452]
[null,"Oberstufe",42.788461538461533,15.865384615384615,19.71153846153846,12.5,3.8461538461538463]
[null,"5. Klasse",53.333333333333336,8.8888888888888893,20,7.7777777777777777,1.1111111111111112]
[null,"6. Klasse",55.434782608695656,0,28.260869565217391,11.956521739130435,0]
[null,"7. Klasse",30,10,32.222222222222221,11.111111111111111,6.666666666666667]
[null,"8. Klasse",45.555555555555557,17.777777777777779,16.666666666666664,10,4.4444444444444446]
[null,"9. Klasse",48.18181818181818,19.090909090909093,13.636363636363635,8.1818181818181817,5.4545454545454541]
[null,"EF",48.4375,6.25,18.75,14.0625,6.25]
[null,"Q1",42.222222222222221,25.555555555555554,18.888888888888889,10,1.1111111111111112]
[null,"Q2",37.037037037037038,11.111111111111111,22.222222222222221,14.814814814814813,5.5555555555555554]
[]
[]
[]
[null,{"$f":"_xlfn.ANCHORARRAY(B64)","v":"Zeilenbeschriftungen"},{"$f":"_xlfn.ANCHORARRAY(C64)","v":" Matthias Hauer (CDU)"}," Kai Gehring (GRÜNE)"," Rüdiger König (FDP)"," Dr. Gereon Wolters (SPD)"," Martin Lange (Die PARTEI)"," Stefan Keute (AfD)"," Ezgi Güyildar (DIE LINKE)"," Volker Wild (dieBasis)"," Kai Hemsteeg (FREIE WÄHLER)"," Dirk Willing (MLPD)"," Diana Kummer (DKP)"," Dirk Schmidt (LKR)"]
[null,"Gesamte Schule",{"$f":"IF($P$2=TRUE,C51,ROUND(C51/SUM($C51:$N51),$P$7))","v":309},{"$f":"IF($P$2=TRUE,D51,ROUND(D51/SUM($C51:$N51),$P$7))","v":144},87,72,25,13,9,7,6,4,3,1]
[null,"Unterstufe",{"$f":"IF($P$2=TRUE,C52,ROUND(C52/SUM($C52:$N52),$P$7))","v":99},44,8,18,1,4,1,0,2,1,3,1]
[null,"Mittelstufe",121,59,46,28,16,8,3,5,3,1,0,0]
[null,"Oberstufe",89,41,33,26,8,1,5,2,1,2,0,0]
[null,"5. Klasse",48,18,8,7,1,3,1,0,1,1,1,1]
[null,"6. Klasse",51,26,0,11,0,1,0,0,1,0,2,0]
[null,"7. Klasse",27,29,9,10,6,7,0,1,1,0,0,0]
[null,"8. Klasse",41,15,16,9,4,1,1,2,0,1,0,0]
[null,"9. Klasse",53,15,21,9,6,0,2,2,2,0,0,0]
[null,"EF",31,12,4,9,4,1,2,1,0,0,0,0]
[null,"Q1",38,17,23,9,1,0,2,0,0,0,0,0]
[null,"Q2",20,12,6,8,3,0,1,1,1,2,0,0]
[]
[null,{"$f":"OFFSET(B110:N122,,,ROWS(_xlfn.ANCHORARRAY(B110))-COUNTIF(_xlfn.ANCHORARRAY(B110),0),IF(P3=FALSE,6,COLUMNS(B110:N110)))","v":"Zeilenbeschriftungen"}," Matthias Hauer (CDU)"," Kai Gehring (GRÜNE)"," Rüdiger König (FDP)"," Dr. Gereon Wolters (SPD)"," Martin Lange (Die PARTEI)"," Stefan Keute (AfD)"," Ezgi Güyildar (DIE LINKE)"," Volker Wild (dieBasis)"," Kai Hemsteeg (FREIE WÄHLER)"," Dirk Willing (MLPD)"," Diana Kummer (DKP)"," Dirk Schmidt (LKR)"]
[null,"Gesamte Schule",309,144,87,72,25,13,9,7,6,4,3,1]
[null,"Unterstufe",99,44,8,18,1,4,1,0,2,1,3,1]
[null,"Mittelstufe",121,59,46,28,16,8,3,5,3,1,0,0]
[null,"Oberstufe",89,41,33,26,8,1,5,2,1,2,0,0]
[null,"5. Klasse",48,18,8,7,1,3,1,0,1,1,1,1]
[null,"6. Klasse",51,26,0,11,0,1,0,0,1,0,2,0]
[null,"7. Klasse",27,29,9,10,6,7,0,1,1,0,0,0]
[null,"8. Klasse",41,15,16,9,4,1,1,2,0,1,0,0]
[null,"9. Klasse",53,15,21,9,6,0,2,2,2,0,0,0]
[null,"EF",31,12,4,9,4,1,2,1,0,0,0,0]
[null,"Q1",38,17,23,9,1,0,2,0,0,0,0,0]
[null,"Q2",20,12,6,8,3,0,1,1,1,2,0,0]
[]
[]
[]
[null,{"$f":"B124:B136","v":"Zeilenbeschriftungen"},{"$f":"C124:N124","v":" Matthias Hauer (CDU)"}," Kai Gehring (GRÜNE)"," Rüdiger König (FDP)"," Dr. Gereon Wolters (SPD)"," Martin Lange (Die PARTEI)"," Stefan Keute (AfD)"," Ezgi Güyildar (DIE LINKE)"," Volker Wild (dieBasis)"," Kai Hemsteeg (FREIE WÄHLER)"," Dirk Willing (MLPD)"," Diana Kummer (DKP)"," Dirk Schmidt (LKR)"]
[null,"Gesamte Schule",{"$f":"OFFSET(Analyse.1!$C$125:$N$136,,,,COUNTA(Analyse.1!$C$124:$N$124))","v":309},144,87,72,25,13,9,7,6,4,3,1]
[null,"Unterstufe",99,44,8,18,1,4,1,0,2,1,3,1]
[null,"Mittelstufe",121,59,46,28,16,8,3,5,3,1,0,0]
[null,"Oberstufe",89,41,33,26,8,1,5,2,1,2,0,0]
[null,"5. Klasse",48,18,8,7,1,3,1,0,1,1,1,1]
[null,"6. Klasse",51,26,0,11,0,1,0,0,1,0,2,0]
[null,"7. Klasse",27,29,9,10,6,7,0,1,1,0,0,0]
[null,"8. Klasse",41,15,16,9,4,1,1,2,0,1,0,0]
[null,"9. Klasse",53,15,21,9,6,0,2,2,2,0,0,0]
[null,"EF",31,12,4,9,4,1,2,1,0,0,0,0]
[null,"Q1",38,17,23,9,1,0,2,0,0,0,0,0]
[null,"Q2",20,12,6,8,3,0,1,1,1,2,0,0]
[]
[null,"Zeilenbeschriftungen","Matthias Hauer (CDU)","Kai Gehring (GRÜNE)","Rüdiger König (FDP)","Dr. Gereon Wolters (SPD)","Martin Lange (Die PARTEI)","Stefan Keute (AfD)","Ezgi Güyildar (DIE LINKE)","Volker Wild (dieBasis)","Kai Hemsteeg (FREIE WÄHLER)","Dirk Willing (MLPD)","Diana Kummer (DKP)","Dirk Schmidt (LKR)"]
[null,"Gesamte Schule",309,144,87,72,25,13,9,7,6,4,3,1]
[null,"Unterstufe",99,44,8,18,1,4,1,0,2,1,3,1]
[null,"Mittelstufe",121,59,46,28,16,8,3,5,3,1,0,0]
[null,"Oberstufe",89,41,33,26,8,1,5,2,1,2,0,0]
[null,"5. Klasse",48,18,8,7,1,3,1,0,1,1,1,1]
[null,"6. Klasse",51,26,0,11,0,1,0,0,1,0,2,0]
[null,"7. Klasse",27,29,9,10,6,7,0,1,1,0,0,0]
[null,"8. Klasse",41,15,16,9,4,1,1,2,0,1,0,0]
[null,"9. Klasse",53,15,21,9,6,0,2,2,2,0,0,0]
[null,"EF",31,12,4,9,4,1,2,1,0,0,0,0]
[null,"Q1",38,17,23,9,1,0,2,0,0,0,0,0]
[null,"Q2",20,12,6,8,3,0,1,1,1,2,0,0]

{"sheet":"Daten-2","index":3,"n_rows":29,"n_cols":9,"rows_kept":29,"cut":false,"hidden":true,"merged":[]}
["Partei","5","6","7","8","9","EF","Q1","Q2"]
["CDU",31,35,18,18,29,17,19,8]
["SPD",4,9,13,9,9,2,7,9]
["FDP",8,4,14,27,37,20,33,21]
["AfD",4,1,2,1,0,null,null,0]
["GRÜNE",24,28,22,23,21,18,18,12]
["DIE LINKE",2,null,1,1,1,1,5]
["Die PARTEI",null,null,3,2,0,2]
["Tierschutzpartei",13,11,5,1,2,1,2,1]
["PIRATEN",1,1,2,2,1,null,2]
["FREIE WÄHLER",null,null,null,null,2,1]
["NPD",null,null,1,null,null,null,1]
["ÖDP",null,null,null,null,null,null,null,1]
["V-Partei³",null,1,null,null,2]
["Gesundheitsforschung",null,null,1]
["MLPD",1,null,null,null,null,null,null,1]
["Die Humanisten",null,null,null,null,null,null,null,1]
["DKP",null,2,1,null,null,null,1]
["SGP"]
["dieBasis",null,null,1,null,3,null,1]
["Bündnis C"]
["du.",null,null,null,1]
["LIEBE",null,null,1,1]
["LKR",2]
["PdF",null,null,null,null,1]
["LfK",null,1]
["Team Todenhöfer",null,null,1,4,3,1,1]
["Volt",null,null,null,null,2,3]
["Ungültig",null,null,1,null,3]

{"sheet":"Analyse.2","index":4,"n_rows":271,"n_cols":30,"rows_kept":271,"cut":false,"hidden":true,"merged":[]}
[null,null,null,null,null,null,null,null,null,null,null,null,null,null,"Diagramme","Tabelle"]
["ID",{"$f":"'Daten-2'!A1:A29","v":"Partei"},{"$f":"'Daten-2'!B1:I29","v":"5"},"6","7","8","9","EF","Q1","Q2",null,null,null,"ABS??",false,true,{"$f":"IF(O2=TRUE,\"Stimmen\",\"der Stimmen\")","v":"der Stimmen"}]
[1,"CDU",31,35,18,18,29,17,19,8,null,null,null,"Alle Kandidaten??",false,true]
[2,"SPD",4,9,13,9,9,2,7,9,null,null,null,null,{"$f":"_xlfn.CONCAT(O2)","v":"FALSCH"},{"$f":"_xlfn.CONCAT(P2)","v":"WAHR"}]
[3,"FDP",8,4,14,27,37,20,33,21,null,null,null,null,{"$f":"_xlfn.CONCAT(O3)","v":"FALSCH"},{"$f":"_xlfn.CONCAT(P3)","v":"WAHR"}]
[4,"AfD",4,1,2,1,0,0,0,0,null,null,null,null,null,{"$f":"P4&P5","v":"WAHRWAHR"}]
[5,"GRÜNE",24,28,22,23,21,18,18,12]
[6,"DIE LINKE",2,0,1,1,1,1,5,0]
[7,"Die PARTEI",0,0,3,2,0,2,0,0]
[8,"Tierschutzpartei",13,11,5,1,2,1,2,1]
[9,"PIRATEN",1,1,2,2,1,0,2,0]
[10,"FREIE WÄHLER",0,0,0,0,2,1,0,0]
[11,"NPD",0,0,1,0,0,0,1,0]
[12,"ÖDP",0,0,0,0,0,0,0,1]
[13,"V-Partei³",0,1,0,0,2,0,0,0]
[14,"Gesundheitsforschung",0,0,1,0,0,0,0,0]
[15,"MLPD",1,0,0,0,0,0,0,1]
[16,"Die Humanisten",0,0,0,0,0,0,0,1]
[17,"DKP",0,2,1,0,0,0,1,0]
[18,"SGP",0,0,0,0,0,0,0,0]
[19,"dieBasis",0,0,1,0,3,0,1,0]
[20,"Bündnis C",0,0,0,0,0,0,0,0]
[21,"du.",0,0,0,1,0,0,0,0]
[22,"LIEBE",0,0,1,1,0,0,0,0]
[23,"LKR",2,0,0,0,0,0,0,0]
[24,"PdF",0,0,0,0,1,0,0,0]
[25,"LfK",0,1,0,0,0,0,0,0]
[26,"Team Todenhöfer",0,0,1,4,3,1,1,0]
[27,"Volt",0,0,0,0,2,3,0,0]
[null,"Ungültig",0,0,1,0,3,0,0,0]
[]
[null,"Bereich",{"$f":"INDEX($B$3:$B$29,COLUMN(C32)-2)","v":"CDU"},{"$f":"INDEX($B$3:$B$29,COLUMN(D32)-2)","v":"SPD"},{"$f":"INDEX($B$3:$B$29,COLUMN(E32)-2)","v":"FDP"},{"$f":"INDEX($B$3:$B$29,COLUMN(F32)-2)","v":"AfD"},{"$f":"INDEX($B$3:$B$29,COLUMN(G32)-2)","v":"GRÜNE"},{"$f":"INDEX($B$3:$B$29,COLUMN(H32)-2)","v":"DIE LINKE"},{"$f":"INDEX($B$3:$B$29,COLUMN(I32)-2)","v":"Die PARTEI"},{"$f":"INDEX($B$3:$B$29,COLUMN(J32)-2)","v":"Tierschutzpartei"},{"$f":"INDEX($B$3:$B$29,COLUMN(K32)-2)","v":"PIRATEN"},{"$f":"INDEX($B$3:$B$29,COLUMN(L32)-2)","v":"FREIE WÄHLER"},{"$f":"INDEX($B$3:$B$29,COLUMN(M32)-2)","v":"NPD"},{"$f":"INDEX($B$3:$B$29,COLUMN(N32)-2)","v":"ÖDP"},{"$f":"INDEX($B$3:$B$29,COLUMN(O32)-2)","v":"V-Partei³"},{"$f":"INDEX($B$3:$B$29,COLUMN(P32)-2)","v":"Gesundheitsforschung"},{"$f":"INDEX($B$3:$B$29,COLUMN(Q32)-2)","v":"MLPD"},{"$f":"INDEX($B$3:$B$29,COLUMN(R32)-2)","v":"Die Humanisten"},{"$f":"INDEX($B$3:$B$29,COLUMN(S32)-2)","v":"DKP"},{"$f":"INDEX($B$3:$B$29,COLUMN(T32)-2)","v":"SGP"},{"$f":"INDEX($B$3:$B$29,COLUMN(U32)-2)","v":"dieBasis"},{"$f":"INDEX($B$3:$B$29,COLUMN(V32)-2)","v":"Bündnis C"},{"$f":"INDEX($B$3:$B$29,COLUMN(W32)-2)","v":"du."},{"$f":"INDEX($B$3:$B$29,COLUMN(X32)-2)","v":"LIEBE"},{"$f":"INDEX($B$3:$B$29,COLUMN(Y32)-2)","v":"LKR"},{"$f":"INDEX($B$3:$B$29,COLUMN(Z32)-2)","v":"PdF"},{"$f":"INDEX($B$3:$B$29,COLUMN(AA32)-2)","v":"LfK"},{"$f":"INDEX($B$3:$B$29,COLUMN(AB32)-2)","v":"Team Todenhöfer"},{"$f":"INDEX($B$3:$B$29,COLUMN(AC32)-2)","v":"Volt"}]
[null,"Gesamte Schule",{"$f":"SUM(C37:C44)","v":175},{"$f":"SUM(D37:D44)","v":62},164,8,166,11,7,36,9,3,2,1,{"$f":"SUM(O37:O44)","v":3},1,2,1,4,0,5,0,1,2,2,1,1,10,5]
[null,"Unterstufe",{"$f":"SUM(C37:C38)","v":66},{"$f":"SUM(D37:D38)","v":13},12,5,52,2,0,24,2,0,0,0,{"$f":"SUM(O37:O38)","v":1},0,1,0,2,0,0,0,0,0,2,0,1,0,0]
[null,"Mittelstufe",{"$f":"SUM(C39:C41)","v":65},{"$f":"SUM(D39:D41)","v":31},78,3,66,3,5,8,5,2,1,0,{"$f":"SUM(O39:O41)","v":2},1,0,0,1,0,4,0,1,2,0,1,0,8,2]
[null,"Oberstufe",{"$f":"SUM(C42:C44)","v":44},{"$f":"SUM(D42:D44)","v":18},74,0,48,6,2,4,2,1,1,1,{"$f":"SUM(O42:O44)","v":0},0,1,1,1,0,1,0,0,0,0,0,0,2,3]
["5","5. Klasse",{"$f":"INDEX($C$3:$J$29,MATCH(C$32,$B$3:$B$29,0),MATCH($A37,$C$2:$J$2,0))","v":31},{"$f":"INDEX($C$3:$J$29,MATCH(D$32,$B$3:$B$29,0),MATCH($A37,$C$2:$J$2,0))","v":4},8,4,24,2,0,13,1,0,0,0,0,0,1,0,0,0,0,0,0,0,2,0,0,0,0]
["6","6. Klasse",{"$f":"INDEX($C$3:$J$29,MATCH(C$32,$B$3:$B$29,0),MATCH($A38,$C$2:$J$2,0))","v":35},9,4,1,28,0,0,11,1,0,0,0,1,0,0,0,2,0,0,0,0,0,0,0,1,0,0]
["7","7. Klasse",18,13,14,2,22,1,3,5,2,0,1,0,0,1,0,0,1,0,1,0,0,1,0,0,0,1,0]
["8","8. Klasse",18,9,27,1,23,1,2,1,2,0,0,0,0,0,0,0,0,0,0,0,1,1,0,0,0,4,0]
["9","9. Klasse",29,9,37,0,21,1,0,2,1,2,0,0,2,0,0,0,0,0,3,0,0,0,0,1,0,3,2]
["EF","EF",17,2,20,0,18,1,2,1,0,1,0,0,0,0,0,0,0,0,0,0,0,0,0,0,0,1,3]
["Q1","Q1",19,7,33,0,18,5,0,2,2,0,1,0,0,0,0,0,1,0,1,0,0,0,0,0,0,1,0]
["Q2","Q2",8,9,21,0,12,0,0,1,0,0,0,1,0,0,1,1,0,0,0,0,0,0,0,0,0,0,0]
[]
[null,null,{"$f":"_xlfn.SORTBY(C51:AC51,C52:AC52,-1)","v":" CDU"}," GRÜNE"," FDP"," SPD"," Tierschutzpartei"," DIE LINKE"," Team Todenhöfer"," PIRATEN"," AfD"," Die PARTEI"," dieBasis"," Volt"," DKP"," FREIE WÄHLER"," V-Partei³"," NPD"," MLPD"," LIEBE"," LKR"," ÖDP"," Gesundheitsforschung"," Die Humanisten"," du."," PdF"," LfK"," SGP"," Bündnis C"]
[null,null,{"$f":"INDEX($C$52:$AC$52,,MATCH(C46,$C$51:$AC$51,0))","v":175},{"$f":"INDEX($C$52:$AC$52,,MATCH(D46,$C$51:$AC$51,0))","v":166},{"$f":"INDEX($C$52:$AC$52,,MATCH(E46,$C$51:$AC$51,0))","v":164},{"$f":"INDEX($C$52:$AC$52,,MATCH(F46,$C$51:$AC$51,0))","v":62},{"$f":"INDEX($C$52:$AC$52,,MATCH(G46,$C$51:$AC$51,0))","v":36},{"$f":"INDEX($C$52:$AC$52,,MATCH(H46,$C$51:$AC$51,0))","v":11},{"$f":"INDEX($C$52:$AC$52,,MATCH(I46,$C$51:$AC$51,0))","v":10},{"$f":"INDEX($C$52:$AC$52,,MATCH(J46,$C$51:$AC$51,0))","v":9},{"$f":"INDEX($C$52:$AC$52,,MATCH(K46,$C$51:$AC$51,0))","v":8},{"$f":"INDEX($C$52:$AC$52,,MATCH(L46,$C$51:$AC$51,0))","v":7},{"$f":"INDEX($C$52:$AC$52,,MATCH(M46,$C$51:$AC$51,0))","v":5},{"$f":"INDEX($C$52:$AC$52,,MATCH(N46,$C$51:$AC$51,0))","v":5},{"$f":"INDEX($C$52:$AC$52,,MATCH(O46,$C$51:$AC$51,0))","v":4},{"$f":"INDEX($C$52:$AC$52,,MATCH(P46,$C$51:$AC$51,0))","v":3},{"$f":"INDEX($C$52:$AC$52,,MATCH(Q46,$C$51:$AC$51,0))","v":3},{"$f":"INDEX($C$52:$AC$52,,MATCH(R46,$C$51:$AC$51,0))","v":2},{"$f":"INDEX($C$52:$AC$52,,MATCH(S46,$C$51:$AC$51,0))","v":2},{"$f":"INDEX($C$52:$AC$52,,MATCH(T46,$C$51:$AC$51,0))","v":2},{"$f":"INDEX($C$52:$AC$52,,MATCH(U46,$C$51:$AC$51,0))","v":2},{"$f":"INDEX($C$52:$AC$52,,MATCH(V46,$C$51:$AC$51,0))","v":1},{"$f":"INDEX($C$52:$AC$52,,MATCH(W46,$C$51:$AC$51,0))","v":1},{"$f":"INDEX($C$52:$AC$52,,MATCH(X46,$C$51:$AC$51,0))","v":1},{"$f":"INDEX($C$52:$AC$52,,MATCH(Y46,$C$51:$AC$51,0))","v":1},{"$f":"INDEX($C$52:$AC$52,,MATCH(Z46,$C$51:$AC$51,0))","v":1},{"$f":"INDEX($C$52:$AC$52,,MATCH(AA46,$C$51:$AC$51,0))","v":1},{"$f":"INDEX($C$52:$AC$52,,MATCH(AB46,$C$51:$AC$51,0))","v":0},{"$f":"INDEX($C$52:$AC$52,,MATCH(AC46,$C$51:$AC$51,0))","v":0}]
[]
[null,"Ranking",{"$f":"MATCH(C51,_xlfn.ANCHORARRAY($C$46),0)","v":1},{"$f":"MATCH(D51,_xlfn.ANCHORARRAY($C$46),0)","v":4},3,9,2,6,10,5,8,14,20,16,15,21,17,22,13,26,11,27,23,18,19,24,25,7,12]
[]
[null,"x"," CDU"," SPD"," FDP"," AfD"," GRÜNE"," DIE LINKE"," Die PARTEI"," Tierschutzpartei"," PIRATEN"," FREIE WÄHLER"," ÖDP"," NPD"," V-Partei³"," Gesundheitsforschung"," MLPD"," Die Humanisten"," DKP"," SGP"," dieBasis"," Bündnis C"," du."," LIEBE"," LKR"," PdF"," LfK"," Team Todenhöfer"," Volt"]
[null,"Gesamte Schule",175,62,164,8,166,11,7,36,9,3,1,2,3,1,2,1,4,0,5,0,1,2,2,1,1,10,5]
[null,"Unterstufe",66,13,12,5,52,2,0,24,2,0,0,0,1,0,1,0,2,0,0,0,0,0,2,0,1,0,0]
[null,"Mittelstufe",65,31,78,3,66,3,5,8,5,2,0,1,2,1,0,0,1,0,4,0,1,2,0,1,0,8,2]
[null,"Oberstufe",44,18,74,0,48,6,2,4,2,1,1,1,0,0,1,1,1,0,1,0,0,0,0,0,0,2,3]
[null,"5. Klasse",31,4,8,4,24,2,0,13,1,0,0,0,0,0,1,0,0,0,0,0,0,0,2,0,0,0,0]
[null,"6. Klasse",35,9,4,1,28,0,0,11,1,0,0,0,1,0,0,0,2,0,0,0,0,0,0,0,1,0,0]
[null,"7. Klasse",18,13,14,2,22,1,3,5,2,0,0,1,0,1,0,0,1,0,1,0,0,1,0,0,0,1,0]
[null,"8. Klasse",18,9,27,1,23,1,2,1,2,0,0,0,0,0,0,0,0,0,0,0,1,1,0,0,0,4,0]
[null,"9. Klasse",29,9,37,0,21,1,0,2,1,2,0,0,2,0,0,0,0,0,3,0,0,0,0,1,0,3,2]
[null,"EF",17,2,20,0,18,1,2,1,0,1,0,0,0,0,0,0,0,0,0,0,0,0,0,0,0,1,3]
[null,"Q1",19,7,33,0,18,5,0,2,2,0,0,1,0,0,0,0,1,0,1,0,0,0,0,0,0,1,0]
[null,"Q2",8,9,21,0,12,0,0,1,0,0,1,0,0,0,1,1,0,0,0,0,0,0,0,0,0,0,0]
[]
[null,{"$f":"B51:B63","v":"x"},{"$f":"_xlfn.SORTBY(C51:AC63,C49:AC49)","v":" CDU"}," GRÜNE"," FDP"," SPD"," Tierschutzpartei"," DIE LINKE"," Team Todenhöfer"," PIRATEN"," AfD"," Die PARTEI"," dieBasis"," Volt"," DKP"," FREIE WÄHLER"," V-Partei³"," NPD"," MLPD"," LIEBE"," LKR"," ÖDP"," Gesundheitsforschung"," Die Humanisten"," du."," PdF"," LfK"," SGP"," Bündnis C"]
[null,"Gesamte Schule",175,166,164,62,36,11,10,9,8,7,5,5,4,3,3,2,2,2,2,1,1,1,1,1,1,0,0]
[null,"Unterstufe",66,52,12,13,24,2,0,2,5,0,0,0,2,0,1,0,1,0,2,0,0,0,0,0,1,0,0]
[null,"Mittelstufe",65,66,78,31,8,3,8,5,3,5,4,2,1,2,2,1,0,2,0,0,1,0,1,1,0,0,0]
[null,"Oberstufe",44,48,74,18,4,6,2,2,0,2,1,3,1,1,0,1,1,0,0,1,0,1,0,0,0,0,0]
[null,"5. Klasse",31,24,8,4,13,2,0,1,4,0,0,0,0,0,0,0,1,0,2,0,0,0,0,0,0,0,0]
[null,"6. Klasse",35,28,4,9,11,0,0,1,1,0,0,0,2,0,1,0,0,0,0,0,0,0,0,0,1,0,0]
[null,"7. Klasse",18,22,14,13,5,1,1,2,2,3,1,0,1,0,0,1,0,1,0,0,1,0,0,0,0,0,0]
[null,"8. Klasse",18,23,27,9,1,1,4,2,1,2,0,0,0,0,0,0,0,1,0,0,0,0,1,0,0,0,0]
[null,"9. Klasse",29,21,37,9,2,1,3,1,0,0,3,2,0,2,2,0,0,0,0,0,0,0,0,1,0,0,0]
[null,"EF",17,18,20,2,1,1,1,0,0,2,0,3,0,1,0,0,0,0,0,0,0,0,0,0,0,0,0]
[null,"Q1",19,18,33,7,2,5,1,2,0,0,1,0,1,0,0,1,0,0,0,0,0,0,0,0,0,0,0]
[null,"Q2",8,12,21,9,1,0,0,0,0,0,0,0,0,0,0,0,1,0,0,1,0,1,0,0,0,0,0]
[]
[null,{"$f":"_xlfn.ANCHORARRAY(B65)","v":"x"},{"$f":"C65:AC65","v":" CDU"}," GRÜNE"," FDP"," SPD"," Tierschutzpartei"," DIE LINKE"," Team Todenhöfer"," PIRATEN"," AfD"," Die PARTEI"," dieBasis"," Volt"," DKP"," FREIE WÄHLER"," V-Partei³"," NPD"," MLPD"," LIEBE"," LKR"," ÖDP"," Gesundheitsforschung"," Die Humanisten"," du."," PdF"," LfK"," SGP"," Bündnis C","Sonstige"]
[null,"Gesamte Schule",{"$f":"IF($O$2=TRUE,C66,C66/SUM($C66:$AC66)*100)","v":25.659824046920821},{"$f":"IF($O$2=TRUE,D66,D66/SUM($C66:$AC66)*100)","v":24.340175953079179},24.046920821114369,9.0909090909090917,5.2785923753665687,1.6129032258064515,1.466275659824047,1.3196480938416422,1.1730205278592376,1.0263929618768328,0.73313782991202348,0.73313782991202348,0.5865102639296188,0.43988269794721413,0.43988269794721413,0.2932551319648094,0.2932551319648094,0.2932551319648094,0.2932551319648094,0.1466275659824047,0.1466275659824047,0.1466275659824047,0.1466275659824047,0.1466275659824047,0.1466275659824047,0,0,{"$f":"SUM(H80:AC80)","v":11.583577712609967}]
[null,"Unterstufe",{"$f":"IF($O$2=TRUE,C67,C67/SUM($C67:$AC67)*100)","v":36.065573770491802},28.415300546448087,6.557377049180328,7.1038251366120218,13.114754098360656,1.0928961748633881,0,1.0928961748633881,2.7322404371584699,0,0,0,1.0928961748633881,0,0.54644808743169404,0,0.54644808743169404,0,1.0928961748633881,0,0,0,0,0,0.54644808743169404,0,0,{"$f":"SUM(H81:AC81)","v":8.7431693989071029}]
[null,"Mittelstufe",22.491349480968857,22.837370242214533,26.989619377162633,10.726643598615917,2.7681660899653981,1.0380622837370241,2.7681660899653981,1.7301038062283738,1.0380622837370241,1.7301038062283738,1.3840830449826991,0.69204152249134954,0.34602076124567477,0.69204152249134954,0.69204152249134954,0.34602076124567477,0,0.69204152249134954,0,0,0.34602076124567477,0,0.34602076124567477,0.34602076124567477,0,0,0,14.186851211072669]
[null,"Oberstufe",20.952380952380953,22.857142857142858,35.238095238095241,8.5714285714285712,1.9047619047619049,2.8571428571428572,0.95238095238095244,0.95238095238095244,0,0.95238095238095244,0.47619047619047622,1.4285714285714286,0.47619047619047622,0.47619047619047622,0,0.47619047619047622,0.47619047619047622,0,0,0.47619047619047622,0,0.47619047619047622,0,0,0,0,0,10.476190476190476]
[null,"5. Klasse",34.444444444444443,26.666666666666668,8.8888888888888893,4.4444444444444446,14.444444444444443,2.2222222222222223,0,1.1111111111111112,4.4444444444444446,0,0,0,0,0,0,0,1.1111111111111112,0,2.2222222222222223,0,0,0,0,0,0,0,0,11.111111111111111]
[null,"6. Klasse",37.634408602150536,30.107526881720432,4.3010752688172049,9.67741935483871,11.827956989247312,0,0,1.0752688172043012,1.0752688172043012,0,0,0,2.1505376344086025,0,1.0752688172043012,0,0,0,0,0,0,0,0,0,1.0752688172043012,0,0,6.4516129032258069]
[null,"7. Klasse",20.930232558139537,25.581395348837212,16.279069767441861,15.11627906976744,5.8139534883720927,1.1627906976744187,1.1627906976744187,2.3255813953488373,2.3255813953488373,3.4883720930232558,1.1627906976744187,0,1.1627906976744187,0,0,1.1627906976744187,0,1.1627906976744187,0,0,1.1627906976744187,0,0,0,0,0,0,16.279069767441861]
[null,"8. Klasse",20,25.555555555555554,30,10,1.1111111111111112,1.1111111111111112,4.4444444444444446,2.2222222222222223,1.1111111111111112,2.2222222222222223,0,0,0,0,0,0,0,1.1111111111111112,0,0,0,0,1.1111111111111112,0,0,0,0,13.333333333333332]
[null,"9. Klasse",25.663716814159294,18.584070796460178,32.743362831858406,7.9646017699115044,1.7699115044247788,0.88495575221238942,2.6548672566371683,0.88495575221238942,0,0,2.6548672566371683,1.7699115044247788,0,1.7699115044247788,1.7699115044247788,0,0,0,0,0,0,0,0,0.88495575221238942,0,0,0,13.274336283185844]
[null,"EF",25.757575757575758,27.27272727272727,30.303030303030305,3.0303030303030303,1.5151515151515151,1.5151515151515151,1.5151515151515151,0,0,3.0303030303030303,0,4.5454545454545459,0,1.5151515151515151,0,0,0,0,0,0,0,0,0,0,0,0,0,12.121212121212121]
[null,"Q1",21.111111111111111,20,36.666666666666664,7.7777777777777777,2.2222222222222223,5.5555555555555554,1.1111111111111112,2.2222222222222223,0,0,1.1111111111111112,{"$f":"IF($O$2=TRUE,N76,N76/SUM($C76:$AC76)*100)","v":0},1.1111111111111112,0,0,1.1111111111111112,0,0,0,0,0,0,0,0,0,0,0,12.222222222222221]
[null,"Q2",14.814814814814813,22.222222222222221,38.888888888888893,16.666666666666664,1.8518518518518516,0,0,0,0,0,0,0,0,0,0,0,1.8518518518518516,0,0,1.8518518518518516,0,1.8518518518518516,0,0,0,0,0,5.5555555555555554]
[]
[]
[null,{"$f":"OFFSET(B79:AC91,,,ROWS(_xlfn.ANCHORARRAY(B79))-COUNTIF(_xlfn.ANCHORARRAY(B79),0),IF(O3=FALSE,6,COLUMNS(B79:AC79)))","v":"x"}," CDU"," GRÜNE"," FDP"," SPD"," Tierschutzpartei"]
[null,"Gesamte Schule",25.659824046920821,24.340175953079179,24.046920821114369,9.0909090909090917,5.2785923753665687]
[null,"Unterstufe",36.065573770491802,28.415300546448087,6.557377049180328,7.1038251366120218,13.114754098360656]
[null,"Mittelstufe",22.491349480968857,22.837370242214533,26.989619377162633,10.726643598615917,2.7681660899653981]
[null,"Oberstufe",20.952380952380953,22.857142857142858,35.238095238095241,8.5714285714285712,1.9047619047619049]
[null,"5. Klasse",34.444444444444443,26.666666666666668,8.8888888888888893,4.4444444444444446,14.444444444444443]
[null,"6. Klasse",37.634408602150536,30.107526881720432,4.3010752688172049,9.67741935483871,11.827956989247312]
[null,"7. Klasse",20.930232558139537,25.581395348837212,16.279069767441861,15.11627906976744,5.8139534883720927]
[null,"8. Klasse",20,25.555555555555554,30,10,1.1111111111111112]
[null,"9. Klasse",25.663716814159294,18.584070796460178,32.743362831858406,7.9646017699115044,1.7699115044247788]
[null,"EF",25.757575757575758,27.27272727272727,30.303030303030305,3.0303030303030303,1.5151515151515151]
[null,"Q1",21.111111111111111,20,36.666666666666664,7.7777777777777777,2.2222222222222223]
[null,"Q2",14.814814814814813,22.222222222222221,38.888888888888893,16.666666666666664,1.8518518518518516]
[]
[null,{"$f":"OFFSET(B79:N91,,,ROWS(_xlfn.ANCHORARRAY(B79))-COUNTIF(_xlfn.ANCHORARRAY(B79),0),6)","v":"x"}," CDU"," GRÜNE"," FDP"," SPD"," Tierschutzpartei",{"$f":"AD79:AD91","v":"Sonstige"},null,{"$f":"\" \"","v":" "}," "," "," "," "," "," "," "," "," "," "," "," "," "," "," "," "," "," "," "]
[null,"Gesamte Schule",25.659824046920821,24.340175953079179,24.046920821114369,9.0909090909090917,5.2785923753665687,11.583577712609967]
[null,"Unterstufe",36.065573770491802,28.415300546448087,6.557377049180328,7.1038251366120218,13.114754098360656,8.7431693989071029]
[null,"Mittelstufe",22.491349480968857,22.837370242214533,26.989619377162633,10.726643598615917,2.7681660899653981,14.186851211072669]
[null,"Oberstufe",20.952380952380953,22.857142857142858,35.238095238095241,8.5714285714285712,1.9047619047619049,10.476190476190476]
[null,"5. Klasse",34.444444444444443,26.666666666666668,8.8888888888888893,4.4444444444444446,14.444444444444443,11.111111111111111]
[null,"6. Klasse",37.634408602150536,30.107526881720432,4.3010752688172049,9.67741935483871,11.827956989247312,6.4516129032258069]
[null,"7. Klasse",20.930232558139537,25.581395348837212,16.279069767441861,15.11627906976744,5.8139534883720927,16.279069767441861]
[null,"8. Klasse",20,25.555555555555554,30,10,1.1111111111111112,13.333333333333332]
[null,"9. Klasse",25.663716814159294,18.584070796460178,32.743362831858406,7.9646017699115044,1.7699115044247788,13.274336283185844]
[null,"EF",25.757575757575758,27.27272727272727,30.303030303030305,3.0303030303030303,1.5151515151515151,12.121212121212121]
[null,"Q1",21.111111111111111,20,36.666666666666664,7.7777777777777777,2.2222222222222223,12.222222222222221]
[null,"Q2",14.814814814814813,22.222222222222221,38.888888888888893,16.666666666666664,1.8518518518518516,5.5555555555555554]
[]
[null,{"$f":"IF(O3=TRUE,B94:AC94,B108:AC108)","v":"x"}," CDU"," GRÜNE"," FDP"," SPD"," Tierschutzpartei","Sonstige",0," "," "," "," "," "," "," "," "," "," "," "," "," "," "," "," "," "," "," "," "]
[null,{"$f":"OFFSET(Analyse.2!$B$95:$AC$120,IF(Analyse.2!$O$3=TRUE,0,14),,12)","v":"Gesamte Schule"},25.659824046920821,24.340175953079179,24.046920821114369,9.0909090909090917,5.2785923753665687,11.583577712609967,0,0,0,0,0,0,0,0,0,0,0,0,0,0,0,0,0,0,0,0,0]
[null,"Unterstufe",36.065573770491802,28.415300546448087,6.557377049180328,7.1038251366120218,13.114754098360656,8.7431693989071029,0,0,0,0,0,0,0,0,0,0,0,0,0,0,0,0,0,0,0,0,0]
[null,"Mittelstufe",22.491349480968857,22.837370242214533,26.989619377162633,10.726643598615917,2.7681660899653981,14.186851211072669,0,0,0,0,0,0,0,0,0,0,0,0,0,0,0,0,0,0,0,0,0]
[null,"Oberstufe",20.952380952380953,22.857142857142858,35.238095238095241,8.5714285714285712,1.9047619047619049,10.476190476190476,0,0,0,0,0,0,0,0,0,0,0,0,0,0,0,0,0,0,0,0,0]
[null,"5. Klasse",34.444444444444443,26.666666666666668,8.8888888888888893,4.4444444444444446,14.444444444444443,11.111111111111111,0,0,0,0,0,0,0,0,0,0,0,0,0,0,0,0,0,0,0,0,0]
[null,"6. Klasse",37.634408602150536,30.107526881720432,4.3010752688172049,9.67741935483871,11.827956989247312,6.4516129032258069,0,0,0,0,0,0,0,0,0,0,0,0,0,0,0,0,0,0,0,0,0]
[null,"7. Klasse",20.930232558139537,25.581395348837212,16.279069767441861,15.11627906976744,5.8139534883720927,16.279069767441861,0,0,0,0,0,0,0,0,0,0,0,0,0,0,0,0,0,0,0,0,0]
[null,"8. Klasse",20,25.555555555555554,30,10,1.1111111111111112,13.333333333333332,0,0,0,0,0,0,0,0,0,0,0,0,0,0,0,0,0,0,0,0,0]
[null,"9. Klasse",25.663716814159294,18.584070796460178,32.743362831858406,7.9646017699115044,1.7699115044247788,13.274336283185844,0,0,0,0,0,0,0,0,0,0,0,0,0,0,0,0,0,0,0,0,0]
[null,"EF",25.757575757575758,27.27272727272727,30.303030303030305,3.0303030303030303,1.5151515151515151,12.121212121212121,0,0,0,0,0,0,0,0,0,0,0,0,0,0,0,0,0,0,0,0,0]
[null,"Q1",21.111111111111111,20,36.666666666666664,7.7777777777777777,2.2222222222222223,12.222222222222221,0,0,0,0,0,0,0,0,0,0,0,0,0,0,0,0,0,0,0,0,0]
[null,"Q2",14.814814814814813,22.222222222222221,38.888888888888893,16.666666666666664,1.8518518518518516,5.5555555555555554,0,0,0,0,0,0,0,0,0,0,0,0,0,0,0,0,0,0,0,0,0]
[]
[null,"Bereich","CDU","GRÜNE","FDP","SPD","Tierschutzpartei","Sonstige "]
[null,"Gesamte Schule",25.659824046920821,24.340175953079179,24.046920821114369,9.0909090909090917,5.2785923753665687,11.583577712609967]
[null,"Unterstufe",36.065573770491802,28.415300546448087,6.557377049180328,7.1038251366120218,13.114754098360656,8.7431693989071029]
[null,"Mittelstufe",22.491349480968857,22.837370242214533,26.989619377162633,10.726643598615917,2.7681660899653981,14.186851211072669]
[null,"Oberstufe",20.952380952380953,22.857142857142858,35.238095238095241,8.5714285714285712,1.9047619047619049,10.476190476190476]
[null,"5. Klasse",34.444444444444443,26.666666666666668,8.8888888888888893,4.4444444444444446,14.444444444444443,11.111111111111111]
[null,"6. Klasse",37.634408602150536,30.107526881720432,4.3010752688172049,9.67741935483871,11.827956989247312,6.4516129032258069]
[null,"7. Klasse",20.930232558139537,25.581395348837212,16.279069767441861,15.11627906976744,5.8139534883720927,16.279069767441861]
[null,"8. Klasse",20,25.555555555555554,30,10,1.1111111111111112,13.333333333333332]
[null,"9. Klasse",25.663716814159294,18.584070796460178,32.743362831858406,7.9646017699115044,1.7699115044247788,13.274336283185844]
[null,"EF",25.757575757575758,27.27272727272727,30.303030303030305,3.0303030303030303,1.5151515151515151,12.121212121212121]
[null,"Q1",21.111111111111111,20,36.666666666666664,7.7777777777777777,2.2222222222222223,12.222222222222221]
[null,"Q2",14.814814814814813,22.222222222222221,38.888888888888893,16.666666666666664,1.8518518518518516,5.5555555555555554]
[]
[]
[]
[null,"y",{"$f":"C108:G108","v":" CDU"}," GRÜNE"," FDP"," SPD"," Tierschutzpartei","Sonstige","Gesamt"]
[null,{"$f":"B109:B120","v":"Gesamte Schule"},{"$f":"C109:H120/100","v":0.25659824046920821},0.24340175953079179,0.2404692082111437,9.0909090909090912E-2,5.2785923753665684E-2,0.11583577712609967,{"$f":"SUM(C153:H153)","v":1}]
[null,"Unterstufe",0.36065573770491804,0.28415300546448086,6.5573770491803282E-2,7.1038251366120214E-2,0.13114754098360656,8.7431693989071024E-2,{"$f":"SUM(C154:H154)","v":1}]
[null,"Mittelstufe",0.22491349480968859,0.22837370242214533,0.26989619377162632,0.10726643598615918,2.768166089965398E-2,0.14186851211072671,1]
[null,"Oberstufe",0.20952380952380953,0.22857142857142856,0.35238095238095241,8.5714285714285715E-2,1.9047619047619049E-2,0.10476190476190476,1.0000000000000002]
[null,"5. Klasse",0.34444444444444444,0.26666666666666666,8.8888888888888892E-2,4.4444444444444446E-2,0.14444444444444443,0.1111111111111111,1]
[null,"6. Klasse",0.37634408602150538,0.30107526881720431,4.3010752688172046E-2,9.6774193548387094E-2,0.11827956989247312,6.4516129032258063E-2,1]
[null,"7. Klasse",0.20930232558139536,0.2558139534883721,0.16279069767441862,0.15116279069767441,5.8139534883720929E-2,0.16279069767441862,1]
[null,"8. Klasse",0.2,0.25555555555555554,0.3,0.1,1.1111111111111112E-2,0.13333333333333333,0.99999999999999989]
[null,"9. Klasse",0.25663716814159293,0.18584070796460178,0.32743362831858408,7.9646017699115043E-2,1.7699115044247787E-2,0.13274336283185845,1.0000000000000002]
[null,"EF",0.25757575757575757,0.27272727272727271,0.30303030303030304,3.0303030303030304E-2,1.5151515151515152E-2,0.12121212121212122,0.99999999999999989]
[null,"Q1",0.21111111111111111,0.2,0.36666666666666664,7.7777777777777779E-2,2.2222222222222223E-2,0.12222222222222222,0.99999999999999989]
[null,"Q2",0.14814814814814814,0.22222222222222221,0.38888888888888895,0.16666666666666663,1.8518518518518517E-2,5.5555555555555552E-2,1]
[]
[]
[]
[]
[]
[]
[null,null,"Spaltenbeschriftungen"]
[null,"Werte","Gesamte Schule","Unterstufe","Mittelstufe","Oberstufe","5. Klasse","6. Klasse","7. Klasse","8. Klasse","9. Klasse","EF","Q1","Q2","Gesamtergebnis"]
[null,"CDU",0.25659824046920821,0.36065573770491804,0.22491349480968859,0.20952380952380953,0.34444444444444444,0.37634408602150538,0.20930232558139536,0.2,0.25663716814159293,0.25757575757575757,0.21111111111111111,0.14814814814814814,3.0552543235315799]
[null,"FDP",0.2404692082111437,6.5573770491803282E-2,0.26989619377162632,0.35238095238095241,8.8888888888888892E-2,4.3010752688172046E-2,0.16279069767441862,0.3,0.32743362831858408,0.30303030303030304,0.36666666666666664,0.38888888888888895,2.9090299510114481]
[null,"GRÜNE",0.24340175953079179,0.28415300546448086,0.22837370242214533,0.22857142857142856,0.26666666666666666,0.30107526881720431,0.2558139534883721,0.25555555555555554,0.18584070796460178,0.27272727272727271,0.2,0.22222222222222221,2.9444015434307422]
[null,"SPD",9.0909090909090912E-2,7.1038251366120214E-2,0.10726643598615918,8.5714285714285715E-2,4.4444444444444446E-2,9.6774193548387094E-2,0.15116279069767441,0.1,7.9646017699115043E-2,3.0303030303030304E-2,7.7777777777777779E-2,0.16666666666666663,1.1017029851127518]
[null,"Tierschutzpartei",5.2785923753665684E-2,0.13114754098360656,2.768166089965398E-2,1.9047619047619049E-2,0.14444444444444443,0.11827956989247312,5.8139534883720929E-2,1.1111111111111112E-2,1.7699115044247787E-2,1.5151515151515152E-2,2.2222222222222223E-2,1.8518518518518517E-2,0.63622877595279859]
[null,"Sonstige ",0.11583577712609967,8.7431693989071024E-2,0.14186851211072671,0.10476190476190476,0.1111111111111111,6.4516129032258063E-2,0.16279069767441862,0.13333333333333333,0.13274336283185845,0.12121212121212122,0.12222222222222222,5.5555555555555552E-2,1.3533824209606806]
[null,"Gesamt ",1,1,1,1.0000000000000002,1,1,1,0.99999999999999989,1.0000000000000002,0.99999999999999989,0.99999999999999989,1,12]
[]
[]
[]
[null,{"$f":"_xlfn.ANCHORARRAY(B65)","v":"x"},{"$f":"C65:AC65","v":" CDU"}," GRÜNE"," FDP"," SPD"," Tierschutzpartei"," DIE LINKE"," Team Todenhöfer"," PIRATEN"," AfD"," Die PARTEI"," dieBasis"," Volt"," DKP"," FREIE WÄHLER"," V-Partei³"," NPD"," MLPD"," LIEBE"," LKR"," ÖDP"," Gesundheitsforschung"," Die Humanisten"," du."," PdF"," LfK"," SGP"," Bündnis C","Sonstige"]
[null,"Gesamte Schule",{"$f":"IF($P$2=TRUE,C66,C66/SUM($C66:$AC66))","v":175},{"$f":"IF($P$2=TRUE,D66,D66/SUM($C66:$AC66))","v":166},164,62,36,11,10,9,8,7,5,5,4,3,3,2,2,2,2,1,1,1,1,1,1,{"$f":"IF($O$2=TRUE,AB66,AB66/SUM($C66:$AC66))","v":0},{"$f":"IF($O$2=TRUE,AC66,AC66/SUM($C66:$AC66))","v":0},{"$f":"SUM(H184:AC184)","v":79}]
[null,"Unterstufe",{"$f":"IF($P$2=TRUE,C67,C67/SUM($C67:$AC67))","v":66},52,12,13,24,2,0,2,5,0,0,0,2,0,1,0,1,0,2,0,0,0,0,0,1,{"$f":"IF($O$2=TRUE,AB67,AB67/SUM($C67:$AC67))","v":0},0,{"$f":"SUM(H185:AC185)","v":16}]
[null,"Mittelstufe",65,66,78,31,8,3,8,5,3,5,4,2,1,2,2,1,0,2,0,0,1,0,1,1,0,{"$f":"IF($O$2=TRUE,AB68,AB68/SUM($C68:$AC68))","v":0},0,41]
[null,"Oberstufe",44,48,74,18,4,6,2,2,0,2,1,3,1,1,0,1,1,0,0,1,0,1,0,0,0,{"$f":"IF($O$2=TRUE,AB69,AB69/SUM($C69:$AC69))","v":0},0,22]
[null,"5. Klasse",31,24,8,4,13,2,0,1,4,0,0,0,0,0,0,0,1,0,2,0,0,0,0,0,0,{"$f":"IF($O$2=TRUE,AB70,AB70/SUM($C70:$AC70))","v":0},0,10]
[null,"6. Klasse",35,28,4,9,11,0,0,1,1,0,0,0,2,0,1,0,0,0,0,0,0,0,0,0,1,{"$f":"IF($O$2=TRUE,AB71,AB71/SUM($C71:$AC71))","v":0},0,6]
[null,"7. Klasse",18,22,14,13,5,1,1,2,2,3,1,0,1,0,0,1,0,1,0,0,1,0,0,0,0,{"$f":"IF($O$2=TRUE,AB72,AB72/SUM($C72:$AC72))","v":0},0,14]
[null,"8. Klasse",18,23,27,9,1,1,4,2,1,2,0,0,0,0,0,0,0,1,0,0,0,0,1,0,0,{"$f":"IF($O$2=TRUE,AB73,AB73/SUM($C73:$AC73))","v":0},0,12]
[null,"9. Klasse",29,21,37,9,2,1,3,1,0,0,3,2,0,2,2,0,0,0,0,0,0,0,0,1,0,{"$f":"IF($O$2=TRUE,AB74,AB74/SUM($C74:$AC74))","v":0},0,15]
[null,"EF",17,18,20,2,1,1,1,0,0,2,0,3,0,1,0,0,0,0,0,0,0,0,0,0,0,{"$f":"IF($O$2=TRUE,AB75,AB75/SUM($C75:$AC75))","v":0},0,8]
[null,"Q1",19,18,33,7,2,5,1,2,0,0,1,0,1,0,0,1,0,0,0,0,0,0,0,0,0,{"$f":"IF($O$2=TRUE,AB76,AB76/SUM($C76:$AC76))","v":0},0,11]
[null,"Q2",8,12,21,9,1,0,0,{"$f":"IF($P$2=TRUE,J77,J77/SUM($C77:$AC77))","v":0},0,0,0,0,0,0,0,0,1,0,0,1,0,1,0,0,0,{"$f":"IF($O$2=TRUE,AB77,AB77/SUM($C77:$AC77))","v":0},0,3]
[]
[]
[null,{"$f":"OFFSET(B183:AC195,,,ROWS(_xlfn.ANCHORARRAY(B183))-COUNTIF(_xlfn.ANCHORARRAY(B183),0),IF(P3=FALSE,6,COLUMNS(B183:AC183)))","v":"x"}," CDU"," GRÜNE"," FDP"," SPD"," Tierschutzpartei"," DIE LINKE"," Team Todenhöfer"," PIRATEN"," AfD"," Die PARTEI"," dieBasis"," Volt"," DKP"," FREIE WÄHLER"," V-Partei³"," NPD"," MLPD"," LIEBE"," LKR"," ÖDP"," Gesundheitsforschung"," Die Humanisten"," du."," PdF"," LfK"," SGP"," Bündnis C"]
[null,"Gesamte Schule",175,166,164,62,36,11,10,9,8,7,5,5,4,3,3,2,2,2,2,1,1,1,1,1,1,0,0]
[null,"Unterstufe",66,52,12,13,24,2,0,2,5,0,0,0,2,0,1,0,1,0,2,0,0,0,0,0,1,0,0]
[null,"Mittelstufe",65,66,78,31,8,3,8,5,3,5,4,2,1,2,2,1,0,2,0,0,1,0,1,1,0,0,0]
[null,"Oberstufe",44,48,74,18,4,6,2,2,0,2,1,3,1,1,0,1,1,0,0,1,0,1,0,0,0,0,0]
[null,"5. Klasse",31,24,8,4,13,2,0,1,4,0,0,0,0,0,0,0,1,0,2,0,0,0,0,0,0,0,0]
[null,"6. Klasse",35,28,4,9,11,0,0,1,1,0,0,0,2,0,1,0,0,0,0,0,0,0,0,0,1,0,0]
[null,"7. Klasse",18,22,14,13,5,1,1,2,2,3,1,0,1,0,0,1,0,1,0,0,1,0,0,0,0,0,0]
[null,"8. Klasse",18,23,27,9,1,1,4,2,1,2,0,0,0,0,0,0,0,1,0,0,0,0,1,0,0,0,0]
[null,"9. Klasse",29,21,37,9,2,1,3,1,0,0,3,2,0,2,2,0,0,0,0,0,0,0,0,1,0,0,0]
[null,"EF",17,18,20,2,1,1,1,0,0,2,0,3,0,1,0,0,0,0,0,0,0,0,0,0,0,0,0]
[null,"Q1",19,18,33,7,2,5,1,2,0,0,1,0,1,0,0,1,0,0,0,0,0,0,0,0,0,0,0]
[null,"Q2",8,12,21,9,1,0,0,0,0,0,0,0,0,0,0,0,1,0,0,1,0,1,0,0,0,0,0]
[]
[null,{"$f":"OFFSET(B183:N195,,,ROWS(_xlfn.ANCHORARRAY(B183))-COUNTIF(_xlfn.ANCHORARRAY(B183),0),6)","v":"x"}," CDU"," GRÜNE"," FDP"," SPD"," Tierschutzpartei",{"$f":"AD183:AD195","v":"Sonstige"},null,{"$f":"\" \"","v":" "}," "," "," "," "," "," "," "," "," "," "," "," "," "," "," "," "," "," "," "]
[null,"Gesamte Schule",175,166,164,62,36,79]
[null,"Unterstufe",66,52,12,13,24,16]
[null,"Mittelstufe",65,66,78,31,8,41]
[null,"Oberstufe",44,48,74,18,4,22]
[null,"5. Klasse",31,24,8,4,13,10]
[null,"6. Klasse",35,28,4,9,11,6]
[null,"7. Klasse",18,22,14,13,5,14]
[null,"8. Klasse",18,23,27,9,1,12]
[null,"9. Klasse",29,21,37,9,2,15]
[null,"EF",17,18,20,2,1,8]
[null,"Q1",19,18,33,7,2,11]
[null,"Q2",8,12,21,9,1,3]
[]
[null,{"$f":"IF($P$3=TRUE,B198:AC198,B212:AC212)","v":"x"}," CDU"," GRÜNE"," FDP"," SPD"," Tierschutzpartei"," DIE LINKE"," Team Todenhöfer"," PIRATEN"," AfD"," Die PARTEI"," dieBasis"," Volt"," DKP"," FREIE WÄHLER"," V-Partei³"," NPD"," MLPD"," LIEBE"," LKR"," ÖDP"," Gesundheitsforschung"," Die Humanisten"," du."," PdF"," LfK"," SGP"," Bündnis C"]
[null,{"$f":"OFFSET(Analyse.2!$B$199:$AC$224,IF(Analyse.2!$P$3=TRUE,0,14),,12)","v":"Gesamte Schule"},175,166,164,62,36,11,10,9,8,7,5,5,4,3,3,2,2,2,2,1,1,1,1,1,1,0,0]
[null,"Unterstufe",66,52,12,13,24,2,0,2,5,0,0,0,2,0,1,0,1,0,2,0,0,0,0,0,1,0,0]
[null,"Mittelstufe",65,66,78,31,8,3,8,5,3,5,4,2,1,2,2,1,0,2,0,0,1,0,1,1,0,0,0]
[null,"Oberstufe",44,48,74,18,4,6,2,2,0,2,1,3,1,1,0,1,1,0,0,1,0,1,0,0,0,0,0]
[null,"5. Klasse",31,24,8,4,13,2,0,1,4,0,0,0,0,0,0,0,1,0,2,0,0,0,0,0,0,0,0]
[null,"6. Klasse",35,28,4,9,11,0,0,1,1,0,0,0,2,0,1,0,0,0,0,0,0,0,0,0,1,0,0]
[null,"7. Klasse",18,22,14,13,5,1,1,2,2,3,1,0,1,0,0,1,0,1,0,0,1,0,0,0,0,0,0]
[null,"8. Klasse",18,23,27,9,1,1,4,2,1,2,0,0,0,0,0,0,0,1,0,0,0,0,1,0,0,0,0]
[null,"9. Klasse",29,21,37,9,2,1,3,1,0,0,3,2,0,2,2,0,0,0,0,0,0,0,0,1,0,0,0]
[null,"EF",17,18,20,2,1,1,1,0,0,2,0,3,0,1,0,0,0,0,0,0,0,0,0,0,0,0,0]
[null,"Q1",19,18,33,7,2,5,1,2,0,0,1,0,1,0,0,1,0,0,0,0,0,0,0,0,0,0,0]
[null,"Q2",8,12,21,9,1,0,0,0,0,0,0,0,0,0,0,0,1,0,0,1,0,1,0,0,0,0,0]
[]
[]
[null,"Zeilenbeschriftungen","Summe von  CDU","Summe von  GRÜNE","Summe von  FDP","Summe von  SPD","Summe von  Tierschutzpartei","DIE LINKE","Team Todenhöfer","PIRATEN","AfD","Die PARTEI","dieBasis","Volt","DKP","FREIE WÄHLER","V-Partei³","NPD","MLPD","LIEBE","LKR","ÖDP","Gesundheitsforschung","Die Humanisten","du.","PdF","LfK","SGP","Bündnis C"]
[null,"Gesamte Schule",175,166,164,62,36,11,10,9,8,7,5,5,4,3,3,2,2,2,2,1,1,1,1,1,1,0,0]
[null,"Unterstufe",66,52,12,13,24,2,0,2,5,0,0,0,2,0,1,0,1,0,2,0,0,0,0,0,1,0,0]
[null,"Mittelstufe",65,66,78,31,8,3,8,5,3,5,4,2,1,2,2,1,0,2,0,0,1,0,1,1,0,0,0]
[null,"Oberstufe",44,48,74,18,4,6,2,2,0,2,1,3,1,1,0,1,1,0,0,1,0,1,0,0,0,0,0]
[null,"5. Klasse",31,24,8,4,13,2,0,1,4,0,0,0,0,0,0,0,1,0,2,0,0,0,0,0,0,0,0]
[null,"6. Klasse",35,28,4,9,11,0,0,1,1,0,0,0,2,0,1,0,0,0,0,0,0,0,0,0,1,0,0]
[null,"7. Klasse",18,22,14,13,5,1,1,2,2,3,1,0,1,0,0,1,0,1,0,0,1,0,0,0,0,0,0]
[null,"8. Klasse",18,23,27,9,1,1,4,2,1,2,0,0,0,0,0,0,0,1,0,0,0,0,1,0,0,0,0]
[null,"9. Klasse",29,21,37,9,2,1,3,1,0,0,3,2,0,2,2,0,0,0,0,0,0,0,0,1,0,0,0]
[null,"EF",17,18,20,2,1,1,1,0,0,2,0,3,0,1,0,0,0,0,0,0,0,0,0,0,0,0,0]
[null,"Q1",19,18,33,7,2,5,1,2,0,0,1,0,1,0,0,1,0,0,0,0,0,0,0,0,0,0,0]
[null,"Q2",8,12,21,9,1,0,0,0,0,0,0,0,0,0,0,0,1,0,0,1,0,1,0,0,0,0,0]
[]
[]
[]
[]
[]
[null,{"$f":"OFFSET(Analyse.2!$B$241:$AC$253,,,ROWS(Analyse.2!$B$241:$B$253)-(COUNTIF(Analyse.2!$B$241:$B$253,\"\")),COLUMNS(Analyse.2!$B$241:$AC$241)-(COUNTIF(Analyse.2!$B$241:$AC$241,\"\")))","v":"Zeilenbeschriftungen"},"Summe von  CDU","Summe von  GRÜNE","Summe von  FDP","Summe von  SPD","Summe von  Tierschutzpartei","DIE LINKE","Team Todenhöfer","PIRATEN","AfD","Die PARTEI","dieBasis","Volt","DKP","FREIE WÄHLER","V-Partei³","NPD","MLPD","LIEBE","LKR","ÖDP","Gesundheitsforschung","Die Humanisten","du.","PdF","LfK","SGP","Bündnis C"]
[null,"Gesamte Schule",175,166,164,62,36,11,10,9,8,7,5,5,4,3,3,2,2,2,2,1,1,1,1,1,1,0,0]
[null,"Unterstufe",66,52,12,13,24,2,0,2,5,0,0,0,2,0,1,0,1,0,2,0,0,0,0,0,1,0,0]
[null,"Mittelstufe",65,66,78,31,8,3,8,5,3,5,4,2,1,2,2,1,0,2,0,0,1,0,1,1,0,0,0]
[null,"Oberstufe",44,48,74,18,4,6,2,2,0,2,1,3,1,1,0,1,1,0,0,1,0,1,0,0,0,0,0]
[null,"5. Klasse",31,24,8,4,13,2,0,1,4,0,0,0,0,0,0,0,1,0,2,0,0,0,0,0,0,0,0]
[null,"6. Klasse",35,28,4,9,11,0,0,1,1,0,0,0,2,0,1,0,0,0,0,0,0,0,0,0,1,0,0]
[null,"7. Klasse",18,22,14,13,5,1,1,2,2,3,1,0,1,0,0,1,0,1,0,0,1,0,0,0,0,0,0]
[null,"8. Klasse",18,23,27,9,1,1,4,2,1,2,0,0,0,0,0,0,0,1,0,0,0,0,1,0,0,0,0]
[null,"9. Klasse",29,21,37,9,2,1,3,1,0,0,3,2,0,2,2,0,0,0,0,0,0,0,0,1,0,0,0]
[null,"EF",17,18,20,2,1,1,1,0,0,2,0,3,0,1,0,0,0,0,0,0,0,0,0,0,0,0,0]
[null,"Q1",19,18,33,7,2,5,1,2,0,0,1,0,1,0,0,1,0,0,0,0,0,0,0,0,0,0,0]
[null,"Q2",8,12,21,9,1,0,0,0,0,0,0,0,0,0,0,0,1,0,0,1,0,1,0,0,0,0,0]

{"sheet":"Wahlbeteiligung","index":5,"n_rows":45,"n_cols":10,"rows_kept":45,"cut":false,"hidden":true,"merged":[]}
["Klasse",5,6,7,8,9,"EF","Q1","Q2","Gesamt"]
["1. Stimme",{"$f":"SUM(_1Stimme[5])","v":90},{"$f":"SUM(_1Stimme[6])","v":92},{"$f":"SUM(_1Stimme[7])","v":91},{"$f":"SUM(_1Stimme[8])","v":90},{"$f":"SUM(_1Stimme[9])","v":110},{"$f":"SUM(_1Stimme[EF])","v":64},{"$f":"SUM(_1Stimme[Q1])","v":90},{"$f":"SUM(_1Stimme[Q2])","v":54},{"$f":"SUM(B2:I2)","v":681}]
["2. Stimme",{"$f":"SUM('Daten-2'!B2:B29)","v":90},{"$f":"SUM('Daten-2'!C2:C29)","v":93},{"$f":"SUM('Daten-2'!D2:D29)","v":87},{"$f":"SUM('Daten-2'!E2:E29)","v":90},{"$f":"SUM('Daten-2'!F2:F29)","v":116},{"$f":"SUM('Daten-2'!G2:G29)","v":66},{"$f":"SUM('Daten-2'!H2:H29)","v":90},{"$f":"SUM('Daten-2'!I2:I29)","v":54},{"$f":"SUM(B3:I3)","v":686}]
["Max",{"$f":"MAX(B2:B3)","v":90},{"$f":"MAX(C2:C3)","v":93},91,90,116,66,90,54,{"$f":"SUM(B4:I4)","v":690}]
[]
["Wahlberechtigte",92,96,95,105,124,92,107,89,{"$f":"SUM(B6:I6)","v":800}]
[]
[]
["Beteiligung",{"$f":"MAX(B2:B3)/B6","v":0.97826086956521741},{"$f":"MAX(C2:C3)/C6","v":0.96875},0.95789473684210524,0.8571428571428571,0.93548387096774188,0.71739130434782605,0.84112149532710279,0.6067415730337079,{"$f":"MAX(J2:J3)/J6","v":0.85750000000000004}]
[]
[null,"Stimmen","Wahlberechtigte","Beteiligung"]
["Unterstufe",{"$f":"B4+C4","v":183},{"$f":"B6+C6","v":188},{"$f":"B12/C12","v":0.97340425531914898}]
["Mittelstufe",{"$f":"D4+E4+F4","v":297},{"$f":"D6+E6+F6","v":324},{"$f":"B13/C13","v":0.91666666666666663}]
["Oberstufe",{"$f":"G4+H4+I4","v":210},{"$f":"G6+H6+I6","v":288},0.72916666666666663]
["Gesamt",{"$f":"J4","v":690},{"$f":"J6","v":800},0.86250000000000004]
[]
[]
["Bereich","Wahlberechtigte","Abgegebene Stimmen","Wahlbeteiligung",null,"Zeilenbeschriftungen"," Wahlberechtigte"," Abgegebene Stimmen"]
["Gesamte Schule",{"$f":"C15","v":800},{"$f":"B15","v":690},{"$f":"C19/B19","v":0.86250000000000004},null,"Gesamte Schule",800,690]
["Unterstufe",{"$f":"C12","v":188},{"$f":"B12","v":183},{"$f":"C20/B20","v":0.97340425531914898},null,"Unterstufe",188,183]
["Mittelstufe",{"$f":"C13","v":324},{"$f":"B13","v":297},0.91666666666666663,null,"Mittelstufe",324,297]
["Oberstufe",288,210,0.72916666666666663,null,"Oberstufe",288,210]
["5. Klasse",{"$f":"B6","v":92},{"$f":"B4","v":90},0.97826086956521741,null,"5. Klasse",92,90]
["6. Klasse",{"$f":"C6","v":96},{"$f":"C4","v":93},0.96875,null,"6. Klasse",96,93]
["7. Klasse",{"$f":"D6","v":95},{"$f":"D4","v":91},0.95789473684210524,null,"7. Klasse",95,91]
["8. Klasse",{"$f":"E6","v":105},{"$f":"E4","v":90},0.8571428571428571,null,"8. Klasse",105,90]
["9. Klasse",{"$f":"F6","v":124},{"$f":"F4","v":116},0.93548387096774188,null,"9. Klasse",124,116]
["EF",{"$f":"G6","v":92},{"$f":"G4","v":66},0.71739130434782605,null,"EF",92,66]
["Q1",{"$f":"H6","v":107},{"$f":"H4","v":90},0.84112149532710279,null,"Q1",107,90]
["Q2",{"$f":"I6","v":89},{"$f":"I4","v":54},0.6067415730337079,null,"Q2",89,54]
[]
[]
[null,null,null,null,null,"Zeilenbeschriftungen","Summe von Wahlbeteiligung"]
[null,null,null,null,null,"Gesamte Schule",0.86250000000000004]
[null,null,null,null,null,"Unterstufe",0.97340425531914898]
[null,null,null,null,null,"Mittelstufe",0.91666666666666663]
[null,null,null,null,null,"Oberstufe",0.72916666666666663]
[null,null,null,null,null,"5. Klasse",0.97826086956521741]
[null,null,null,null,null,"6. Klasse",0.96875]
[null,null,null,null,null,"7. Klasse",0.95789473684210524]
[null,null,null,null,null,"8. Klasse",0.8571428571428571]
[null,null,null,null,null,"9. Klasse",0.93548387096774188]
[null,null,null,null,null,"EF",0.71739130434782605]
[null,null,null,null,null,"Q1",0.84112149532710279]
[null,null,null,null,null,"Q2",0.6067415730337079]